{"text_format":"1","workbook":"xlsx","n_sheets":7,"sheets":["Berechnung der Werte","Materialdaten","Anzahl Rovings","UD-Gelegelagen","Dicke der Stegbeschichtung","Flächensteckung","Roving-Gelege Umrechnung"],"not_rendered":{"charts":7,"images":8,"macros":1,"external_links":0,"defined_names":4,"comments":2,"pivot_tables":0},"unopened":[{"sheet":"Anzahl Rovings","index":2,"reason":"not_a_worksheet"},{"sheet":"UD-Gelegelagen","index":3,"reason":"not_a_worksheet"},{"sheet":"Dicke der Stegbeschichtung","index":4,"reason":"not_a_worksheet"}],"bounds":{"document_bytes":16777216,"sheet_cells":100000,"rows_first":2000,"rows_last":500,"rows_between":2000,"halvings":0,"cell_chars":16384,"cell_head_chars":4096},"cells_cut":0,"cells_raw":0,"read":"whole","date_system":"1900"}

{"sheet":"Berechnung der Werte","index":0,"n_rows":129,"n_cols":25,"rows_kept":129,"cut":false,"hidden":false,"merged":[[6,1,6,2],[8,1,8,8],[103,8,103,13],[103,14,103,17],[102,1,102,8],[76,1,76,5],[10,1,10,8],[29,1,29,14],[51,1,51,5],[80,10,81,10],[54,1,54,5],[28,1,28,8],[79,1,79,5],[62,8,64,14],[18,1,18,5]]}
[null,"Holmberechnung für Sandwich- oder Schalenbautragflächen"]
[null,"Dyna"]
[null,"(C) Christian Baron 11.2013"]
[null,"Das Kopieren und die Weitergabe dieses Programms für nicht kommerzielle Zwecke ist unter Nennung der Quelle erlaubt"]
[null,"Eingabefelder sind rot"]
[null,"Ergebnisfelder sind grün"]
[null,"Ergebnisfeld in blau ist als Diagramm vorhanden"]
[]
[null,"Bitte die Kommentare bei bestimmten Werten beachten! Kommentare werden bei Excel sichtbar wenn der Cursor auf das entsprechende Feld kommt. Felder mit einem Kommentar haben rechts oben ein rotes Dreieck."]
[]
[null,"Zuerst werden die Anzahl der Trapeze einer Tragflächenhälfte eingegeben. Es wird die Flächentiefe an der Wurzel und an den Trapezabschnitten benötigt (t) und die Längen der Abschnitte(l). Die zur Anwendung kommenden Profile sind für die Berechnung nicht von Bedeutung, wohl aber die Profildicken. Daher wird die Profildicke zu jeder Flächentiefe in % benötigt. Bitte diese Werte in die Tabelle eingeben. Im Beispiel wird eine Fläche mit fünf Trapezen gezeigt. Hat die zu berechnende Fläche nur zwei oder drei Trapeze, werden die weiteren Felder nicht ausgefüllt (gleich Null setzten). "]
[]
[]
[]
[]
[]
[]
[]
[null,"Tabelle zur Eingabe der Flächengeometrie:"]
[]
["hilfszellen",null,"t in mm","l in mm","Profildicke in %"]
[{"$f":"D22","v":0},"t1=",261,0,12.56]
[{"$f":"A22+D23","v":750},"t2=",252.9,750,11.68]
[{"$f":"A23+D24","v":1500},"t3=",226.9,750,10.8,null,null,null," "]
[{"$f":"A24+D25","v":2250},"t4=",176.3,750,9.92]
[{"$f":"A25+D26","v":2826},"t5=",102.6,{"$f":"2826-2250","v":576},9.09]
[{"$f":"A26+D27","v":3000},"t6=",40,{"$f":"3000-2826","v":174},8.1]
[]
[null,"Der Auftrieb den die Tragfläche produziert, muß von der Konstruktion aufgenommen werden. Dies führt zu einer Biege-, Torsions- und Querkraftbeanspruchung. Der Auftrieb der Tragfläche berechnet sich mit den in den roten Feldern einzugebenden Werten für den maximale Auftriebsbeiwert ca und die maximal zu erwartende Fluggeschwindigkeit (V) in m/s2. Als Standardwerte können hier ca=1,0 und V=40 eingegeben werden. "]
[]
[]
[null,"A= Auftrieb in [ N ]"]
[null,"maximaler Auftriebsbeiwert ca","ca=",1.2]
[null,"maximale Fluggeschwindigkeit V","V=",52,"m/s"]
[null,"Flügelfläche","F=",{"$f":"2*(((C22+C23)/2*D23)+((C23+C24)/2*D24)+((C24+C25)/2*D25)+((C25+C26)/2*D26)+((C26+C27)/2*D27))/1000000","v":1.2331337999999998},"m2"]
[]
[null,"Damit erhält man diesen Auftrieb:","A=",{"$f":"0.6*D33*D34*D34*D35","v":2400.7635325439996},"N"]
[]
[null,"Das Gesamtgewicht des Modells:","G=",80,"N"]
[]
[null,"Das Lastvielfache n errechnet sich damit zu:","n=",{"$f":"D37/D39","v":30.009544156799997}]
[]
[null,"Mit diesem Auftrieb errechnet sich folgendes maximale Biegemoment in Rumpfmitte:"]
[]
[null,"Die Spannweite der Tragfläche (b) ist:","b=",{"$f":"(D22+D23+D24+D25+D26+D27)*2","v":6000},"mm"]
[]
[null,"Dies ist das maximale Biegemoment:","MB(max)=",{"$f":" D37/2*D45/4","v":1800572.6494079998},"Nmm"]
[]
[null,null,null,null,null,null,null,"Abfangradius r=",{"$f":"D34*D34/(9.81*(D41-1))","v":9.5016006975170733},"m"]
[]
[]
[null,"Für die Berechnung der örtlichen Beanspruchung, z.B. an einer beliebigen Stelle der Tragfläche, ist ausgehend von diesem bisher berechnetem Mb(max) das Mb an jeder Stelle der Tragfläche folgendermaßen zu berechnen:"]
[]
[null,"Mb(x) = q x X**2 / 2"]
[null,"mit dem maximalen Biegemoment (Mb(max)) erhält man durch Umstellen der Gleichung die örtliche Beanspruchung "]
[]
[null,"q = Mb(max) x 2 / (b/2)**2","q=",{"$f":" D47*2/(D45/2)/(D45/2)","v":0.40012725542399996},"N/mm"]
[null,null,null,null,null,null,null," "]
[null,"Der nächste Punkt ist die Querkraftbeanspruchung des Flächenholms."]
[]
{"$rows_left_out":70}
{"sheet":"Materialdaten","index":1,"n_rows":84,"n_cols":16,"rows_kept":84,"cut":false,"hidden":false,"merged":[[59,0,59,2],[60,0,60,2],[61,0,61,2]]}
["Materialkennzahlen"]
[]
["Materialien",null,null,"Spezifikation","Querschitts-flächen  [mm²]","Biegefestigkeit      Sigma (zul) [N/mm²]","Druckfestig-keit   [N/mm²]","Zugfestigkeit [N/mm²]","Schubfestig-keit        Tau(zul) [N/mm²]","Bruch-dehnung [%]","Dichte [kg/m³]","Elastizitäts-modul [N/mm² ]","Garnfeinheit in tex","Flächengewicht des UD-Geleges","Faser des UD-Geleges"]
["Gurtmaterialien","C Rovings HTA12k",1,"CFK",0.8,1000,null,800,null,1,1800,80000,800]
[null,"C Rovings HTA 24k",2,"CFK",1.5,1000,null,800,null,1,1800,80000,1600]
[null,"C Rovings C60",3,"CFK",2.5,null,null,700,null,1,null,80000]
[null,"Aramid Rovings",4,"AFK",null,null,35,192,null,3.3,1450,48000]
[null,"GfK Rovings 1,0mm²",5,"GFK",1,null,null,750,30,2.5,2500,30000]
[null,"GfK Rovings 2,0mm²",6,"GFK",2,null,null,750,30,2.5,2500,30000]
[null,"Polystahl",7,"GFK-Ex",5.7,null,null,750,null,2.5,2100,50000]
[null,"Kiefernholz",8,"längs",null,65,40,70,5,0.7,570,10000]
[null,"UD-CST50/300",9,"CFK-UD-Gelege",0.8,null,null,800,null,1,null,135000,800,50,"AS4"]
[null,"UD-CST80/200",10,"CFK-UD-Gelege",0.8,null,null,800,null,1,null,135000,800,80,"T700"]
[null,"UD-CST100/300",11,"CFK-UD-Gelege",0.8,null,null,800,null,1,null,135000,800,100,"T700"]
[null,"UD-CST125/300",12,"CFK-UD-Gelege",0.8,null,null,800,null,1,null,135000,800,125,"T700"]
[null,"UD-CST150/300",13,"CFK-UD-Gelege",0.8,null,null,800,null,1,null,135000,800,150,"T700"]
[null,"UD-CST200/300",14,"CFK-UD-Gelege",0.8,null,null,800,null,1,null,135000,800,200,"T700"]
[null,"UD-CS250/244",15,"CFK-UD-Gelege",0.8,null,null,800,null,0.4,null,230000,800,250,"UHM K63712","Faser von Sumitomo, Dichte 2,12, Zugfestigkeit 2600MPa, Zug E-Modul 640GPa, Bruchdehnung 0,4%"]
[null,"UD-CST300/50",16,"CFK-UD-Gelege",0.8,null,null,800,null,1,null,135000,800,300,"T700"]
["Stegmaterialien","AFK (Aramid-)gewebe",1,null,null,null,null,null,null,2.5,null,24000]
[null,"GFK Gewebe",2,null,null,null,90,90,80,3.5,null,15000]
[null,"CFK Gewebe",3,null,null,null,200,200,90,1.3,null,40000]
["Kernmaterial","Abachi längs",1,"längs",null,47,30,null,null,null,400,6000]
[null,"Balsaholz längs*",2,"längs",null,21,6,12.3,1.2,0.7,150,3290]
[null,"Balsaholz quer",3,"quer",null,null,12,0.7,2.1,null,150]
[null,"Kiefernholz längs",4,"längs",null,65,7.7,70,5,0.7,570,10000]
[null,"Kiefernholz quer",5,"quer",null,null,40,3,10,null,570,500]
[null,"Buchenholz längs",6,"längs",null,105,53,135,null,null,780,16000]
[null,"Buchenholz quer",7,"quer",null,null,53,7,null,null,780,1500]
[null,"Pappelholz längs",8,"längs",null,55,12,75,null,null,450,9000]
[null,"Pappelholz quer",9,"quer",null,null,37,10,null,null,450,350]
[null,"Birkensperrholz",10,null,null,80,52,132,20,1,650,8000]
[null,"Buchensperrholz",11,null,null,80,56,117,20,null,725,10000]
[null,"Rohacell 31",12,null,null,0.8,0.4,1,0.4,3.5,30,36]
[null,"Rohacell 51",13,null,null,1.6,0.9,1.9,0.8,4,50,70]
[null,"Rohacell 71",14,null,null,2.5,1.5,2.8,1.3,4.5,70,92]
[null,"Styropor PS20",15,"PS20",null,null,0.3,null,null,null,20]
[null,"Styropor PS30",16,"PS30",null,null,0.5,null,null,null,30]
[null,"Roofmate",17,null,null,null,0.3,null,null,null,32]
[null,"PVC Hartschaum 30",18,30,null,0.45,0.25,0.45,1.2,null,30]
[null,"PVC Hartschaum 40",19,40,null,0.6,0.35,0.7,2.1,null,40]
[null,"PVC Hartschaum 60",20,60,null,1.2,0.8,1.6,2.8,null,60]
[null,"PVC Hartschaum 80",21,80,null,1.8,1.2,2,3.8,null,80]
[null,"Titan",null,99.5,null,null,null,200,250,30,null,110000]
[null,"Aluminium",null,"Al-Mg 2,5",null,null,null,170,140,3,2700,71000]
[null,"Stahl",null,null,null,null,null,1200,null,null,7850,210000]
[null,"Stahldraht",null,null,null,500,350,null,null,null,7850,210000]
[null,"*für eine Rohdichte von 150kg/m3"]
[null,"längs bedeutet, dass der Faserverlauf des Holzes in Spannweitenrichtung verläuft"]
[null,"quer bedeutet, dass der Faserverlauf des Holzes von Holmgurt zu Holmgurt verläuft"]
[]
["Festigkeit von Klebe-Verbindungen","Material",null,"Schubfestigkeit Tau N/mm2"]
[null,"Holz/Holz",null,3.5]
[null,"GFK/Holz",null,3.5]
[null,"GFK/GFK",null,5]
[]
[]
[]
[null,null,null,null,null,"Faser","Faserdurchmesser in mm","Faserquerschnitt in mm^2","Fläche 24k","60% Faservolumen","Für die Anzahlberechnung zu verwenden"]
["12k = 12000 filaments = 800 tex, have a cross section of 0.7mm²",null,null,null,null,"T300",7.0000000000000001E-3,"0,38485 x 10^-4",0.92400000000000004,{"$f":"I60 * 100/60","v":1.54},1.5]
{"$rows_left_out":25}
{"sheet":"Flächensteckung","index":5,"n_rows":68,"n_cols":18,"rows_kept":68,"cut":false,"hidden":false,"merged":[[2,0,2,8],[13,3,13,5],[12,3,12,11],[13,6,13,8],[13,9,13,11],[12,12,12,17],[13,12,13,13],[13,14,13,15],[13,16,13,17],[25,0,28,3]]}
["Berechnung einer Flächensteckverbindung"]
[]
["Mit den Werten der Holmberechnung ist es möglich, an den Knickstellen der Tragfläche, den nötigen Querschnitt einer Tragflächensteckung zu bestimmen. Hierzu wird das Mb(x) dieser Stelle aus der Tabelle der Ergebnisse eingesetzt. Die Ergebnisse in der unten aufgeführten Tabelle ergeben sich daher automatisch mit den Ergebnissen aus 'Berechnung der Werte'."]
["Für den rechteckigen Querschnitt wird verwendet:"]
["Breite des Stabes wird berechnet und mit b4 -",1.5,null,null,", mm  anschließend  verglichen,  Höhe  ist  h1  -",{"$f":"B5","v":1.5},"mm. Diese werden für den Platzbedarf einer Hülle um den Stab abgezogen."]
[]
["b= Mb(Verbindungspunkt) x 6 / Sigma (Material) x (Steghöhe h1 - 3mm)**2"]
[]
["Für den runden Vollquerschnitt wird verwendet:"]
[]
["D=3.Wurzel (((Mb(Verbindungspunkt))/(Sigma(Material)*0,1))"]
[]
[null,null,null,"Steckverbindung mit rechteckigem Querschnitt",null,null,null,null,null,null,null,null,"Steckverbindung mit rundem Querschnitt"]
["Erklärungen der Tabellenwerte:","Abstand von der Rumpf-mittellinie","Holmbreite an dieser Stelle","Aus CFK",null,null,"Aus GFK",null,null,"Aus Stahl",null,null,"Aus CFK",null,"Aus GFK",null,"Aus Stahl"]
[null,"L(x) in mm","b(x) in mm","Berechnete Mindeststabbreite in mm (B)","maximal mögliche Stabbreite mit gewählten Holmstegbreite in mm (B)","Stabhöhe in der Rechnung in mm (H)","Berechnete Mindeststabbreite in mm","maximal mögliche Stabbreite aufgrund der gewählten Holmstegbreite in mm","Stabhöhe in der Rechnung in mm","Berechnete Mindeststabbreite in mm","maximal mögliche Stabbreite aufgrund der gewählten Holmstegbreite in mm","Stabhöhe in der Rechnung in mm","Berechneter Mindestdurchmesser in mm","maximal möglicher Durchmesser aufgrund der gewählten Holmstegbreite in mm","Berechneter Mindestdurchmesser in mm","maximal möglicher Durchmesser aufgrund der gewählten Holmstegbreite in mm","Berechneter Mindestdurchmesser in mm","maximal möglicher Durchmesser aufgrund der gewählten Holmstegbreite in mm"]
["Maximalwerte in der Rumpfmitte (L=0)",0,{"$f":"'Berechnung der Werte'!D107","v":30},{"$f":"('Berechnung der Werte'!F107*6)/(Materialdaten!$H$5*('Berechnung der Werte'!K107-$B$5)*('Berechnung der Werte'!K107-$B$5))","v":24.809470529685647},{"$f":"'Berechnung der Werte'!D107-$B$5","v":28.5},{"$f":"'Berechnung der Werte'!K107-$B$5","v":23.330669858858418},{"$f":"('Berechnung der Werte'!F107*6)/(Materialdaten!$H$8*('Berechnung der Werte'!K107-$B$5)*('Berechnung der Werte'!K107-$B$5))","v":26.463435231664693},{"$f":"'Berechnung der Werte'!D107-$B$5","v":28.5},{"$f":"'Berechnung der Werte'!K107-$B$5","v":23.330669858858418},{"$f":"('Berechnung der Werte'!F107*6)/(Materialdaten!$H$46*('Berechnung der Werte'!K107-$B$5)*('Berechnung der Werte'!K107-$B$5))","v":16.539647019790433},{"$f":"'Berechnung der Werte'!D107-$B$5","v":28.5},{"$f":"'Berechnung der Werte'!K107-$B$5","v":23.330669858858418},{"$f":"(('Berechnung der Werte'!F107/(Materialdaten!$H$5*0.1)))^(1/3)","v":28.23407434747741},{"$f":"'Berechnung der Werte'!D107-$B$5","v":28.5},{"$f":"(('Berechnung der Werte'!F107/(Materialdaten!$H$8*0.1)))^(1/3)","v":28.848049983163719},{"$f":"'Berechnung der Werte'!D107-$B$5","v":28.5},{"$f":"(('Berechnung der Werte'!F107/(Materialdaten!$H$46*0.1)))^(1/3)","v":24.664735789868519},{"$f":"'Berechnung der Werte'!D107-$B$5","v":28.5}]
["Wert an der Tragflächen Wurzelrippe",{"$f":"'Berechnung der Werte'!C108","v":0},{"$f":"'Berechnung der Werte'!D108","v":30},{"$f":"('Berechnung der Werte'!F108*6)/(Materialdaten!$H$5*('Berechnung der Werte'!K108-$B$5)*('Berechnung der Werte'!K108-$B$5))","v":24.809470529685647},{"$f":"'Berechnung der Werte'!D108-$B$5","v":28.5},{"$f":"'Berechnung der Werte'!K108-$B$5","v":23.330669858858418},{"$f":"('Berechnung der Werte'!F108*6)/(Materialdaten!$H$8*('Berechnung der Werte'!K108-$B$5)*('Berechnung der Werte'!K108-$B$5))","v":26.463435231664693},{"$f":"'Berechnung der Werte'!D108-$B$5","v":28.5},{"$f":"'Berechnung der Werte'!K108-$B$5","v":23.330669858858418},{"$f":"('Berechnung der Werte'!F108*6)/(Materialdaten!$H$46*('Berechnung der Werte'!K108-$B$5)*('Berechnung der Werte'!K108-$B$5))","v":16.539647019790433},{"$f":"'Berechnung der Werte'!D108-$B$5","v":28.5},{"$f":"'Berechnung der Werte'!K108-$B$5","v":23.330669858858418},{"$f":"(('Berechnung der Werte'!F108/(Materialdaten!$H$5*0.1)))^(1/3)","v":28.23407434747741},{"$f":"'Berechnung der Werte'!D108-$B$5","v":28.5},{"$f":"(('Berechnung der Werte'!F108/(Materialdaten!$H$8*0.1)))^(1/3)","v":28.848049983163719},{"$f":"'Berechnung der Werte'!D108-$B$5","v":28.5},{"$f":"(('Berechnung der Werte'!F108/(Materialdaten!$H$46*0.1)))^(1/3)","v":24.664735789868519},{"$f":"'Berechnung der Werte'!D108-$B$5","v":28.5}]
["Ein Zwischenwert (beliebig einzugeben)",{"$f":"'Berechnung der Werte'!C109","v":375},{"$f":"'Berechnung der Werte'!D109","v":29},{"$f":"('Berechnung der Werte'!F109*6)/(Materialdaten!$H$5*('Berechnung der Werte'!K109-$B$5)*('Berechnung der Werte'!K109-$B$5))","v":19.840066976495088},{"$f":"'Berechnung der Werte'!D109-$B$5","v":27.5},{"$f":"'Berechnung der Werte'!K109-$B$5","v":22.828240655308907},{"$f":"('Berechnung der Werte'!F109*6)/(Materialdaten!$H$8*('Berechnung der Werte'!K109-$B$5)*('Berechnung der Werte'!K109-$B$5))","v":21.162738108261426},{"$f":"'Berechnung der Werte'!D109-$B$5","v":27.5},{"$f":"'Berechnung der Werte'!K109-$B$5","v":22.828240655308907},{"$f":"('Berechnung der Werte'!F109*6)/(Materialdaten!$H$46*('Berechnung der Werte'!K109-$B$5)*('Berechnung der Werte'!K109-$B$5))","v":13.226711317663391},{"$f":"'Berechnung der Werte'!D109-$B$5","v":27.5},{"$f":"'Berechnung der Werte'!K109-$B$5","v":22.828240655308907},{"$f":"(('Berechnung der Werte'!F109/(Materialdaten!$H$5*0.1)))^(1/3)","v":25.829277369234287},{"$f":"'Berechnung der Werte'!D109-$B$5","v":27.5},{"$f":"(('Berechnung der Werte'!F109/(Materialdaten!$H$8*0.1)))^(1/3)","v":26.390958506604772},{"$f":"'Berechnung der Werte'!D109-$B$5","v":27.5},{"$f":"(('Berechnung der Werte'!F109/(Materialdaten!$H$46*0.1)))^(1/3)","v":22.563952128018467},{"$f":"'Berechnung der Werte'!D109-$B$5","v":27.5}]
["Werte z.B. am Ende des ersten Tragflächentrapezes",{"$f":"'Berechnung der Werte'!C110","v":750},{"$f":"'Berechnung der Werte'!D110","v":28},{"$f":"('Berechnung der Werte'!F110*6)/(Materialdaten!$H$5*('Berechnung der Werte'!K110-$B$5)*('Berechnung der Werte'!K110-$B$5))","v":15.329738416233541},{"$f":"'Berechnung der Werte'!D110-$B$5","v":26.5},{"$f":"'Berechnung der Werte'!K110-$B$5","v":22.260240259876323},{"$f":"('Berechnung der Werte'!F110*6)/(Materialdaten!$H$8*('Berechnung der Werte'!K110-$B$5)*('Berechnung der Werte'!K110-$B$5))","v":16.351720977315775},{"$f":"'Berechnung der Werte'!D110-$B$5","v":26.5},{"$f":"'Berechnung der Werte'!K110-$B$5","v":22.260240259876323},{"$f":"('Berechnung der Werte'!F110*6)/(Materialdaten!$H$46*('Berechnung der Werte'!K110-$B$5)*('Berechnung der Werte'!K110-$B$5))","v":10.219825610822362},{"$f":"'Berechnung der Werte'!D110-$B$5","v":26.5},{"$f":"'Berechnung der Werte'!K110-$B$5","v":22.260240259876323},{"$f":"(('Berechnung der Werte'!F110/(Materialdaten!$H$5*0.1)))^(1/3)","v":23.306714858813109},{"$f":"'Berechnung der Werte'!D110-$B$5","v":26.5},{"$f":"(('Berechnung der Werte'!F110/(Materialdaten!$H$8*0.1)))^(1/3)","v":23.813540579220611},{"$f":"'Berechnung der Werte'!D110-$B$5","v":26.5},{"$f":"(('Berechnung der Werte'!F110/(Materialdaten!$H$46*0.1)))^(1/3)","v":20.360290797838349},{"$f":"'Berechnung der Werte'!D110-$B$5","v":26.5}]
["Ein Zwischenwert (beliebig einzugeben)",{"$f":"'Berechnung der Werte'!C111","v":1125},{"$f":"'Berechnung der Werte'!D111","v":27},{"$f":"('Berechnung der Werte'!F111*6)/(Materialdaten!$H$5*('Berechnung der Werte'!K111-$B$5)*('Berechnung der Werte'!K111-$B$5))","v":12.444203584956282},{"$f":"'Berechnung der Werte'!D111-$B$5","v":25.5},{"$f":"'Berechnung der Werte'!K111-$B$5","v":20.588865654322863},{"$f":"('Berechnung der Werte'!F111*6)/(Materialdaten!$H$8*('Berechnung der Werte'!K111-$B$5)*('Berechnung der Werte'!K111-$B$5))","v":13.2738171572867},{"$f":"'Berechnung der Werte'!D111-$B$5","v":25.5},{"$f":"'Berechnung der Werte'!K111-$B$5","v":20.588865654322863},{"$f":"('Berechnung der Werte'!F111*6)/(Materialdaten!$H$46*('Berechnung der Werte'!K111-$B$5)*('Berechnung der Werte'!K111-$B$5))","v":8.2961357233041877},{"$f":"'Berechnung der Werte'!D111-$B$5","v":25.5},{"$f":"'Berechnung der Werte'!K111-$B$5","v":20.588865654322863},{"$f":"(('Berechnung der Werte'!F111/(Materialdaten!$H$5*0.1)))^(1/3)","v":20.63923355351119},{"$f":"'Berechnung der Werte'!D111-$B$5","v":25.5},{"$f":"(('Berechnung der Werte'!F111/(Materialdaten!$H$8*0.1)))^(1/3)","v":21.088052465905523},{"$f":"'Berechnung der Werte'!D111-$B$5","v":25.5},{"$f":"(('Berechnung der Werte'!F111/(Materialdaten!$H$46*0.1)))^(1/3)","v":18.030031239477328},{"$f":"'Berechnung der Werte'!D111-$B$5","v":25.5}]
["Wert z.B. am Ende des zweiten Trapezes",{"$f":"'Berechnung der Werte'!C112","v":1500},{"$f":"'Berechnung der Werte'!D112","v":23.2},{"$f":"('Berechnung der Werte'!F112*6)/(Materialdaten!$H$5*('Berechnung der Werte'!K112-$B$5)*('Berechnung der Werte'!K112-$B$5))","v":9.7560072876170576},{"$f":"'Berechnung der Werte'!D112-$B$5","v":21.7},{"$f":"'Berechnung der Werte'!K112-$B$5","v":18.602439573142725},{"$f":"('Berechnung der Werte'!F112*6)/(Materialdaten!$H$8*('Berechnung der Werte'!K112-$B$5)*('Berechnung der Werte'!K112-$B$5))","v":10.406407773458195},{"$f":"'Berechnung der Werte'!D112-$B$5","v":21.7},{"$f":"'Berechnung der Werte'!K112-$B$5","v":18.602439573142725},{"$f":"('Berechnung der Werte'!F112*6)/(Materialdaten!$H$46*('Berechnung der Werte'!K112-$B$5)*('Berechnung der Werte'!K112-$B$5))","v":6.5040048584113705},{"$f":"'Berechnung der Werte'!D112-$B$5","v":21.7},{"$f":"'Berechnung der Werte'!K112-$B$5","v":18.602439573142725},{"$f":"(('Berechnung der Werte'!F112/(Materialdaten!$H$5*0.1)))^(1/3)","v":17.786352297341814},{"$f":"'Berechnung der Werte'!D112-$B$5","v":21.7},{"$f":"(('Berechnung der Werte'!F112/(Materialdaten!$H$8*0.1)))^(1/3)","v":18.173132711103705},{"$f":"'Berechnung der Werte'!D112-$B$5","v":21.7},{"$f":"(('Berechnung der Werte'!F112/(Materialdaten!$H$46*0.1)))^(1/3)","v":15.537809905875408},{"$f":"'Berechnung der Werte'!D112-$B$5","v":21.7}]
["Ein Zwischenwert (beliebig einzugeben)",{"$f":"'Berechnung der Werte'!C113","v":1875},{"$f":"'Berechnung der Werte'!D113","v":19.399999999999999},{"$f":"('Berechnung der Werte'!F113*6)/(Materialdaten!$H$5*('Berechnung der Werte'!K113-$B$5)*('Berechnung der Werte'!K113-$B$5))","v":7.8079590336884346},{"$f":"'Berechnung der Werte'!D113-$B$5","v":17.899999999999999},{"$f":"'Berechnung der Werte'!K113-$B$5","v":15.595469758582315},{"$f":"('Berechnung der Werte'!F113*6)/(Materialdaten!$H$8*('Berechnung der Werte'!K113-$B$5)*('Berechnung der Werte'!K113-$B$5))","v":8.3284896359343321},{"$f":"'Berechnung der Werte'!D113-$B$5","v":17.899999999999999},{"$f":"'Berechnung der Werte'!K113-$B$5","v":15.595469758582315},{"$f":"('Berechnung der Werte'!F113*6)/(Materialdaten!$H$46*('Berechnung der Werte'!K113-$B$5)*('Berechnung der Werte'!K113-$B$5))","v":5.2053060224589558},{"$f":"'Berechnung der Werte'!D113-$B$5","v":17.899999999999999},{"$f":"'Berechnung der Werte'!K113-$B$5","v":15.595469758582315},{"$f":"(('Berechnung der Werte'!F113/(Materialdaten!$H$5*0.1)))^(1/3)","v":14.682310327258127},{"$f":"'Berechnung der Werte'!D113-$B$5","v":17.899999999999999},{"$f":"(('Berechnung der Werte'!F113/(Materialdaten!$H$8*0.1)))^(1/3)","v":15.001590524142902},{"$f":"'Berechnung der Werte'!D113-$B$5","v":17.899999999999999},{"$f":"(('Berechnung der Werte'!F113/(Materialdaten!$H$46*0.1)))^(1/3)","v":12.82617947908871},{"$f":"'Berechnung der Werte'!D113-$B$5","v":17.899999999999999}]
["Wert z.B. am Ende des dritten Trapezes",{"$f":"'Berechnung der Werte'!C114","v":2250},{"$f":"'Berechnung der Werte'!D114","v":15.6},{"$f":"('Berechnung der Werte'!F114*6)/(Materialdaten!$H$5*('Berechnung der Werte'!K114-$B$5)*('Berechnung der Werte'!K114-$B$5))","v":5.2130916902263023},{"$f":"'Berechnung der Werte'!D114-$B$5","v":14.1},{"$f":"'Berechnung der Werte'!K114-$B$5","v":12.724135434864793},{"$f":"('Berechnung der Werte'!F114*6)/(Materialdaten!$H$8*('Berechnung der Werte'!K114-$B$5)*('Berechnung der Werte'!K114-$B$5))","v":5.5606311362413878},{"$f":"'Berechnung der Werte'!D114-$B$5","v":14.1},{"$f":"'Berechnung der Werte'!K114-$B$5","v":12.724135434864793},{"$f":"('Berechnung der Werte'!F114*6)/(Materialdaten!$H$46*('Berechnung der Werte'!K114-$B$5)*('Berechnung der Werte'!K114-$B$5))","v":3.4753944601508682},{"$f":"'Berechnung der Werte'!D114-$B$5","v":14.1},{"$f":"'Berechnung der Werte'!K114-$B$5","v":12.724135434864793},{"$f":"(('Berechnung der Werte'!F114/(Materialdaten!$H$5*0.1)))^(1/3)","v":11.204699830133496},{"$f":"'Berechnung der Werte'!D114-$B$5","v":14.1},{"$f":"(('Berechnung der Werte'!F114/(Materialdaten!$H$8*0.1)))^(1/3)","v":11.448356222626318},{"$f":"'Berechnung der Werte'!D114-$B$5","v":14.1},{"$f":"(('Berechnung der Werte'!F114/(Materialdaten!$H$46*0.1)))^(1/3)","v":9.7882068848387487},{"$f":"'Berechnung der Werte'!D114-$B$5","v":14.1}]
[]
[]
["Ist die berechnete Stabbreite bei rechteckigem Querschnitt (D16-D23, G16-G23, J16-J23) größer als die Werte der maximal möglichen Stabbreite (E16-E23, H16-H23, K16-K23), so ist der Holmsteg an der Stelle der Steckverbindung zu verbreitern. Das gleiche gilt für die Rechnungen mit Kreisquerschnitt."]
[]
[]
[]
[]
[]
[]
[]
[]
[]
[]
[]
[null,"Stützstoffeinlage (nicht lasttragend)"]
[]
[]
[]
[]
[]
[]
[]
[]
[]
[]
[]
[]
[null,null,null,null,"Abstand von der Rumpfmittellinie (L(x) in mm) : ",750,"Wählen aus die liste!"]
[null,null,null,null,"Maximale Dicke des Verbinders (H) : ",{"$f":"VLOOKUP(F51,B16:F23,5)","v":22.260240259876323},"mm"]
[null,null,null,null,"Gewählte Dicke des Verbinders (H) :  ",22.3,"mm"]
[null,null,null,null,"Mbmax = ",{"$f":"VLOOKUP(F51,'Berechnung der Werte'!C107:F118,4)","v":1012822.1152919999},"N/mm²"]
[null,null,null,null,"Sigma = ",{"$f":"'Berechnung der Werte'!I68","v":800},"N/mm²"]
[null,null,null,null,"Maximale Breite des Verbinders (B) = ",{"$f":"VLOOKUP(F51,B16:C23,2)-B5","v":26.5},"mm"]
[null,null,null,null,"Breite des Verbinders (B) = ",26.5]
[]
[]
[null,null,null,null,"Maximale Höhe (h) des Stützstoffs im Verbinder =",{"$f":"POWER(POWER(F53,3)-(F54*6*F53/F55/F57),1/3)","v":16.747504507320979},"mm","Bei negativen Werten an dieser Stelle müssen die Abmessungen des Verbinders vergrößert werden um mit Stützstoff zu arbeiten. "]
{"$rows_left_out":9}
{"sheet":"Roving-Gelege Umrechnung","index":6,"n_rows":21,"n_cols":5,"rows_kept":21,"cut":false,"hidden":false,"merged":[]}
[null,"Erstellt von Jaromir Ufer"]
[null,"Umrechnung bei gleichem Fasertyp (Roving / Gelege):"]
[]
[null,"Garnfeinheit Roving in [tex]:",1600,null,"1 tex: 1 Gramm pro 1000 Meter Garn oder Roving"]
[null,"Anzahl Rovings:",1]
[null,"Flächengewicht Gelege in [g/m²]:",200]
[]
[null,"Gelegebreite, die der Anzahl der Rovings entspricht in [mm]:",{"$f":"C5*C4/C6","v":8},null,"Rovinganzahl = Gelegebreite x Flächengewicht / tex-Zahl"]
[]
[null,"Umrechnung bei unterschiedlichem Fasertyp (Roving / Gelege):"]
[]
[null,"Zugfestigkeit Roving [MPa]:",3950]
[null,"Anzahl Rovings:",1]
[null,"Garnfeinheit (tex) Roving in [g/km]:",1600]
[null,"Dichte Rovings in [g/cm³]:",1.77]
[]
[null,"Zugfestigkeit Gelege [MPa]:",2600]
[null,"Flächengewicht Gelege in [g/m²]:",250]
[null,"Dichte Rovings in [g/cm³]:",2.12]
[]
[null,"Gelegebreite, die der Anzahl der Rovings entspricht in [mm]:",{"$f":"(C12*C13*C14/C15)/(C17*C18/C19)","v":11.645719252498914}]