{"text_format":"1","workbook":"xlsx","n_sheets":7,"sheets":["Berechnung der Werte","Materialdaten","Anzahl Rovings","UD-Gelegelagen","Dicke der Stegbeschichtung","Flächensteckung","Roving-Gelege Umrechnung"],"not_rendered":{"charts":7,"images":8,"macros":1,"external_links":0,"defined_names":4,"comments":2,"pivot_tables":0},"unopened":[{"sheet":"Anzahl Rovings","index":2,"reason":"not_a_worksheet"},{"sheet":"UD-Gelegelagen","index":3,"reason":"not_a_worksheet"},{"sheet":"Dicke der Stegbeschichtung","index":4,"reason":"not_a_worksheet"}],"bounds":{"document_bytes":16777216,"sheet_cells":100000,"rows_first":2000,"rows_last":500,"rows_between":2000,"halvings":0,"cell_chars":16384,"cell_head_chars":4096},"cells_cut":0,"cells_raw":0,"read":"whole","date_system":"1900"}

{"sheet":"Berechnung der Werte","index":0,"n_rows":129,"n_cols":25,"rows_kept":129,"cut":false,"hidden":false,"merged":[[6,1,6,2],[8,1,8,8],[103,8,103,13],[103,14,103,17],[102,1,102,8],[76,1,76,5],[10,1,10,8],[29,1,29,14],[51,1,51,5],[80,10,81,10],[54,1,54,5],[28,1,28,8],[79,1,79,5],[62,8,64,14],[18,1,18,5]]}
[null,"Holmberechnung für Sandwich- oder Schalenbautragflächen"]
[null,"Dyna"]
[null,"(C) Christian Baron 11.2013"]
[null,"Das Kopieren und die Weitergabe dieses Programms für nicht kommerzielle Zwecke ist unter Nennung der Quelle erlaubt"]
[null,"Eingabefelder sind rot"]
[null,"Ergebnisfelder sind grün"]
[null,"Ergebnisfeld in blau ist als Diagramm vorhanden"]
[]
[null,"Bitte die Kommentare bei bestimmten Werten beachten! Kommentare werden bei Excel sichtbar wenn der Cursor auf das entsprechende Feld kommt. Felder mit einem Kommentar haben rechts oben ein rotes Dreieck."]
[]
[null,"Zuerst werden die Anzahl der Trapeze einer Tragflächenhälfte eingegeben. Es wird die Flächentiefe an der Wurzel und an den Trapezabschnitten benötigt (t) und die Längen der Abschnitte(l). Die zur Anwendung kommenden Profile sind für die Berechnung nicht von Bedeutung, wohl aber die Profildicken. Daher wird die Profildicke zu jeder Flächentiefe in % benötigt. Bitte diese Werte in die Tabelle eingeben. Im Beispiel wird eine Fläche mit fünf Trapezen gezeigt. Hat die zu berechnende Fläche nur zwei oder drei Trapeze, werden die weiteren Felder nicht ausgefüllt (gleich Null setzten). "]
[]
[]
[]
[]
[]
[]
[]
[null,"Tabelle zur Eingabe der Flächengeometrie:"]
[]
["hilfszellen",null,"t in mm","l in mm","Profildicke in %"]
[{"$f":"D22","v":0},"t1=",261,0,12.56]
[{"$f":"A22+D23","v":750},"t2=",252.9,750,11.68]
[{"$f":"A23+D24","v":1500},"t3=",226.9,750,10.8,null,null,null," "]
[{"$f":"A24+D25","v":2250},"t4=",176.3,750,9.92]
[{"$f":"A25+D26","v":2826},"t5=",102.6,{"$f":"2826-2250","v":576},9.09]
[{"$f":"A26+D27","v":3000},"t6=",40,{"$f":"3000-2826","v":174},8.1]
[]
[null,"Der Auftrieb den die Tragfläche produziert, muß von der Konstruktion aufgenommen werden. Dies führt zu einer Biege-, Torsions- und Querkraftbeanspruchung. Der Auftrieb der Tragfläche berechnet sich mit den in den roten Feldern einzugebenden Werten für den maximale Auftriebsbeiwert ca und die maximal zu erwartende Fluggeschwindigkeit (V) in m/s2. Als Standardwerte können hier ca=1,0 und V=40 eingegeben werden. "]
[]
[]
[null,"A= Auftrieb in [ N ]"]
[null,"maximaler Auftriebsbeiwert ca","ca=",1.2]
[null,"maximale Fluggeschwindigkeit V","V=",52,"m/s"]
[null,"Flügelfläche","F=",{"$f":"2*(((C22+C23)/2*D23)+((C23+C24)/2*D24)+((C24+C25)/2*D25)+((C25+C26)/2*D26)+((C26+C27)/2*D27))/1000000","v":1.2331337999999998},"m2"]
[]
[null,"Damit erhält man diesen Auftrieb:","A=",{"$f":"0.6*D33*D34*D34*D35","v":2400.7635325439996},"N"]
[]
[null,"Das Gesamtgewicht des Modells:","G=",80,"N"]
[]
[null,"Das Lastvielfache n errechnet sich damit zu:","n=",{"$f":"D37/D39","v":30.009544156799997}]
[]
[null,"Mit diesem Auftrieb errechnet sich folgendes maximale Biegemoment in Rumpfmitte:"]
[]
[null,"Die Spannweite der Tragfläche (b) ist:","b=",{"$f":"(D22+D23+D24+D25+D26+D27)*2","v":6000},"mm"]
[]
[null,"Dies ist das maximale Biegemoment:","MB(max)=",{"$f":" D37/2*D45/4","v":1800572.6494079998},"Nmm"]
[]
[null,null,null,null,null,null,null,"Abfangradius r=",{"$f":"D34*D34/(9.81*(D41-1))","v":9.5016006975170733},"m"]
[]
[]
[null,"Für die Berechnung der örtlichen Beanspruchung, z.B. an einer beliebigen Stelle der Tragfläche, ist ausgehend von diesem bisher berechnetem Mb(max) das Mb an jeder Stelle der Tragfläche folgendermaßen zu berechnen:"]
[]
[null,"Mb(x) = q x X**2 / 2"]
[null,"mit dem maximalen Biegemoment (Mb(max)) erhält man durch Umstellen der Gleichung die örtliche Beanspruchung "]
[]
[null,"q = Mb(max) x 2 / (b/2)**2","q=",{"$f":" D47*2/(D45/2)/(D45/2)","v":0.40012725542399996},"N/mm"]
[null,null,null,null,null,null,null," "]
[null,"Der nächste Punkt ist die Querkraftbeanspruchung des Flächenholms."]
[]
[null,"Q(max)= q x b/2","Q(max)=",{"$f":"D57*(D45/2)","v":1200.3817662719998},"N"]
[]
[null,"Q(x)= q x X",null,null,null,null,null,null,"Hier sind die Werte zu sehen die bei der gegenwärtigen Rechnung verwendet werden:"]
[null,null,null,null,null,null,null,null,null,null,null,null,null,null,null,null,null,null,null,null,null,null,"Berechnung des Flächenträgheitsmoments des Holmquerschnitts"]
[]
[null,"An dieser Stelle kann der Roving oder das UD-Gelege für den Holmgurt gewählt werden:",null,null,null,null,null,null,"Sigma (zul.)",null,"Querschnitt des Rovings ",null,null,null,null,"Flächengewicht bei UD-Gelegen",null,null,null,null,"E-Modul der verwendeten Faser","Tex-Zahl","J="]
[]
[null,null,null,null,null,null,null,null,{"$f":"VLOOKUP(N68,Gurtmaterialien,6,0)","v":800},"[N/mm2]",{"$f":"VLOOKUP(N68,Gurtmaterialien,3,0)","v":1.5},null,null,2,null,{"$f":"VLOOKUP(N68,Gurtmaterialien,12,0)","v":0},null,null,null,null,{"$f":"VLOOKUP(N68,Gurtmaterialien,10,0)","v":80000},{"$f":"VLOOKUP(N68,Gurtmaterialien,11,0)","v":1600},{"$f":"POWER((-K107*D107*L107/2)-(L107*L107*D107/2),2)+(D107*L107*L107*L107/12)+POWER((K107*D107*L107/2)-(L107*L107*D107/2),2)+(D107*L107*L107*L107/12)+(S107*K107*K107*K107/6)","v":2492574.8655291218}]
[null,"Hier bitte das Material für die Stegbeschichtung wählen:"]
[null,null,null,null,null,null,null,null,"Tau(zul)",null,null,null,null,2]
[null,null,null,null,null,null,null,null,{"$f":"VLOOKUP(N70,Stegmaterialien,7,0)","v":80},"[N/mm2]"]
[]
[null,"Hier bitte das Material für den Holmsteg wählen:"]
[null,null,null,null,null,null,null,null,"Tau(zul) Kernmaterial",null,null,null,null,3]
[null,null,null,null,null,null,null,null,{"$f":"VLOOKUP(N74,Kernmaterial,7,0)","v":2.1},"[N/mm2]"]
[]
[null,"Hier bitte die Dicke der Beplankung oder der Schalendicke eingeben falls die Holmgurte darunter liegen und nicht bis zur größten Profildicke gesetzt werden können:",null,null,null,null,null,null,"Sigma (druckf.)",null,null,null,null,{"$f":"N74","v":3}]
[null,"Beplankungsdicke:",1,"mm",null,null,null,null,{"$f":"VLOOKUP(N77,Kernmaterial,5,0)","v":12},"[N/mm2]"]
[]
[]
[]
[]
[]
[]
[]
[]
[]
[]
[]
[]
[]
[]
[]
[]
[]
[]
[]
[]
[]
[]
[]
[]
[null,"Eingabe der Stellen (L(x)) in Spannweitenrichtung an der Tragflächenhälfte, an der die Werte ermittelt werden sollen. Es sollen zudem für die Breite des Holms an den jeweiligen Stellen vorläufige Werte eingegeben werden. Die Breite (b) kann dann anschießend sofort verändert werden um Werte zu erhalten, die durch den Materialeinsatz leichter zu realisieren sind."]
[null,null,null,null,null,null,null,null,"Berechnung Holmgurt",null,null,null,null,null,"Berechnung Holmsteg"]
[null,"Erklärungen der Tabellenwerte:","Abstand von der Rumpfmittellinie","Holmbreite an dieser Stelle","Holmbreite mit linear verlauf (nur für entwurf, wird nicht mit gerechnet)","Biegemoment an der Stelle die L(x) angibt","Querkraft an der Stelle die L(x) angibt","Profilhöhe (siehe Skizze) an der Stelle die L(x) angibt","Profilhöhe (siehe Skizze) um die Beplankungs- /Schalendicke reduziert","Das erforderliche Widerstandsmoment","Höhe des Steges zwischen den Holmgurten (siehe Skizze)","Höhe eines Holmgurts (siehe Skizze)","Anzahl der Rovings an der Stelle die L(x) angibt","Rechnung für UD-Gelege:","Querschnittsfläche eines Holmgurts ","Scherbeanspruchung des Stegkernes","Vergleich der Scherbeanspruchung des Steges mit dem gewählten Materialwert (zusätzliche Beschichtung notwendig oder nicht)","Die sich ergebende Querschnittsfläche die durch die Querkraft beansprucht wird ","Dicke der Stegbeschichtung (siehe Skizze) ohne Berücksichtigung des verwendeten Holmstegkernmaterials"]
[null,null,"L(x) in mm","b(x) in mm",null,"Mb(x) in Nmm","Q(x) in N","H in mm","h in mm","Wb(erf) in mm3","h1 in mm","t in mm","n","Anzahl Lagen","mm³","Tau(steg) in N/mm2",null,"F(erf) in mm2","t1 in mm"]
[null,"Maximalwerte in der Rumpfmitte (L=0)",0,30,38.4,{"$f":"D57*((D45/2)-C107)*((D45/2)-C107)/2","v":1800572.6494079998},{"$f":"D57*((D45/2)-C107)","v":1200.3817662719998},{"$f":"C22*E22/100","v":32.781600000000005},{"$f":"H107-2*C78","v":30.781600000000005},{"$f":"F107/I68","v":2250.7158117599997},{"$f":"POWER((((D107*I107*I107*I107)-(6*I107*J107))/D107),1/3)","v":24.830669858858418},{"$f":"(I107-K107)/2","v":2.9754650705707935},{"$f":"L107*D107/K68","v":59.509301411415869},{"$f":" ROUNDUP(M107*V$68/D107/P$68,0)","v":{"$error":"#DIV/0!"}},{"$f":"D107*L107","v":89.263952117123807},{"$f":"G107/(K107*D107)","v":1.6114235246104458},{"$f":"IF(P107>=I75,\"Beschichtung notwendig!\",\"keine Beschichtung\")","v":"keine Beschichtung"},{"$f":"G107/I71","v":15.004772078399998},{"$f":"R107/(2*K107)","v":0.30214191086445863},null,null,null,{"$f":"C107","v":0},null,{"$f":"N107","v":{"$error":"#DIV/0!"}}]
[null,"Wert an der Tragflächen Wurzelrippe",{"$f":"D22","v":0},30,{"$f":"$E$107-C108/$C$118*($E$107-$E$118)","v":38.4},{"$f":"D57*((D45/2)-C108)*((D45/2)-C108)/2","v":1800572.6494079998},{"$f":"D57*((D45/2)-C108)","v":1200.3817662719998},{"$f":"C22*E22/100","v":32.781600000000005},{"$f":"H108-2*C78","v":30.781600000000005},{"$f":"F108/I68","v":2250.7158117599997},24.830669858858418,2.9754650705707935,{"$f":"L108*D108/K68","v":59.509301411415869},{"$error":"#DIV/0!"},89.263952117123807,1.6114235246104458,{"$f":"IF(P108>I75,\"Beschichtung notwendig!\",\"keine Beschichtung\")","v":"keine Beschichtung"},{"$f":"G108/I71","v":15.004772078399998},0.30214191086445863,null,null,null,{"$f":"C108","v":0},null,{"$f":"N107","v":{"$error":"#DIV/0!"}}]
[null,"Ein Zwischenwert (beliebig einzugeben)",375,29,{"$f":"$E$107-C109/$C$118*($E$107-$E$118)","v":34.6},{"$f":"D57*((D45/2)-C109)*((D45/2)-C109)/2","v":1378563.4347029999},{"$f":"D57*((D45/2)-C109)","v":1050.3340454879999},{"$f":"((H108-H110)*(C109-C110)/(C108-C110))+H110","v":31.160160000000001},{"$f":"H109-2*C78","v":29.160160000000001},{"$f":"F109/I68","v":1723.2042933787498},24.328240655308907,2.4159596723455472,{"$f":"L109*D109/K68","v":46.708553665347246},{"$error":"#DIV/0!"},70.062830498020872,1.4887396041008658,{"$f":"IF(P109>I75,\"Beschichtung notwendig!\",\"keine Beschichtung\")","v":"keine Beschichtung"},{"$f":"G109/I71","v":13.129175568599999},0.26983405324328191,null,null,null,{"$f":"C108","v":0},null,{"$f":"N108","v":{"$error":"#DIV/0!"}}]
[null,"Werte z.B. am Ende des ersten Tragflächentrapezes",{"$f":"D22+D23","v":750},28,30.799999999999997,{"$f":"D57*((D45/2)-C110)*((D45/2)-C110)/2","v":1012822.1152919999},{"$f":"D57*((D45/2)-C110)","v":900.28632470399987},{"$f":"C23*E23/100","v":29.538719999999998},{"$f":"H110-2*C78","v":27.538719999999998},{"$f":"F110/I68","v":1266.0276441149999},23.760240259876323,1.8892398700618376,{"$f":"L110*D110/K68","v":35.26581090782097},{"$error":"#DIV/0!"},52.898716361731452,1.3532305512684331,{"$f":"IF(P110>I75,\"Beschichtung notwendig!\",\"keine Beschichtung\")","v":"keine Beschichtung"},{"$f":"G110/I71","v":11.253579058799998},0.23681534647197577,null,null,null,{"$f":"C109","v":375},null,{"$f":"N108","v":{"$error":"#DIV/0!"}}]
[null,"Ein Zwischenwert (beliebig einzugeben)",1125,27,27,{"$f":"D57*((D45/2)-C111)*((D45/2)-C111)/2","v":703348.69117499993},{"$f":"D57*((D45/2)-C111)","v":750.23860391999995},{"$f":"((H110-H112)*(C111-C112)/(C110-C112))+H112","v":27.02196},{"$f":"H111-2*C78","v":25.02196},{"$f":"F111/I68","v":879.18586396874991},22.088865654322863,1.4665471728385686,{"$f":"L111*D111/K68","v":26.397849111094235},{"$error":"#DIV/0!"},39.596773666641354,1.2579466684638043,{"$f":"IF(P111>I75,\"Beschichtung notwendig!\",\"keine Beschichtung\")","v":"keine Beschichtung"},{"$f":"G111/I71","v":9.3779825489999986},0.21227850030326698,null,null,null,{"$f":"C109","v":375},null,{"$f":"N109","v":{"$error":"#DIV/0!"}}]
[null,"Wert z.B. am Ende des zweiten Trapezes",{"$f":"D22+D23+D24","v":1500},23.2,23.2,{"$f":"D57*((D45/2)-C112)*((D45/2)-C112)/2","v":450143.16235199996},{"$f":"D57*((D45/2)-C112)","v":600.19088313599991},{"$f":"C24*E24/100","v":24.505200000000006},{"$f":"H112-2*C78","v":22.505200000000006},{"$f":"F112/I68","v":562.67895293999993},20.102439573142725,1.2013802134286404,{"$f":"L112*D112/K68","v":18.581347301029638},{"$error":"#DIV/0!"},27.872020951544457,1.2869232409712004,{"$f":"IF(P112>I75,\"Beschichtung notwendig!\",\"keine Beschichtung\")","v":"keine Beschichtung"},{"$f":"G112/I71","v":7.5023860391999992},0.18660386994082406,null,null,null,{"$f":"C110","v":750},null,{"$f":"N109","v":{"$error":"#DIV/0!"}}]
[null,"Ein Zwischenwert (beliebig einzugeben)",1875,19.399999999999999,19.399999999999999,{"$f":"D57*((D45/2)-C113)*((D45/2)-C113)/2","v":253205.52882299997},{"$f":"D57*((D45/2)-C113)","v":450.14316235199993},{"$f":"((H112-H114)*(C113-C114)/(C112-C114))+H114","v":20.997080000000004},{"$f":"H113-2*C78","v":18.997080000000004},{"$f":"F113/I68","v":316.50691102874998},17.095469758582315,0.9508051207088446,{"$f":"L113*D113/K68","v":12.297079561167722},{"$error":"#DIV/0!"},18.445619341751584,1.3572751213631695,{"$f":"IF(P113>I75,\"Beschichtung notwendig!\",\"keine Beschichtung\")","v":"keine Beschichtung"},{"$f":"G113/I71","v":5.626789529399999},0.16456960846528429,null,null,null,{"$f":"C110","v":750},null,{"$f":"N110","v":{"$error":"#DIV/0!"}}]
[null,"Wert z.B. am Ende des dritten Trapezes",{"$f":"D22+D23+D24+D25","v":2250},15.6,15.600000000000001,{"$f":"D57*((D45/2)-C114)*((D45/2)-C114)/2","v":112535.79058799999},{"$f":"D57*((D45/2)-C114)","v":300.09544156799996},{"$f":"C25*E25/100","v":17.488960000000002},{"$f":"H114-2*C78","v":15.488960000000002},{"$f":"F114/I68","v":140.66973823499998},14.224135434864793,0.6324122825676044,{"$f":"L114*D114/K68","v":6.5770877387030851},{"$error":"#DIV/0!"},9.8656316080546276,1.3524117067142403,{"$f":"IF(P114>I75,\"Beschichtung notwendig!\",\"keine Beschichtung\")","v":"keine Beschichtung"},{"$f":"G114/I71","v":3.7511930195999996},0.13186014140463842,null,null,null,{"$f":"C111","v":1125},null,{"$f":"N110","v":{"$error":"#DIV/0!"}}]
[null,"Ein Zwischenwert (beliebig einzugeben)",2587,12.2,12.185066666666668,{"$f":"D57*((D45/2)-C115)*((D45/2)-C115)/2","v":34124.65291520812},{"$f":"D57*((D45/2)-C115)","v":165.25255649011197},{"$f":"((H114-H116)*(C115-C116)/(C114-C116))+H116","v":12.713260451388889},{"$f":"H115-2*C78","v":10.713260451388889},{"$f":"F115/I68","v":42.655816144010153},10.01616565699122,0.34854739719883465,{"$f":"L115*D115/K68","v":2.8348521638838551},{"$error":"#DIV/0!"},4.2522782458257824,1.352343000250642,{"$f":"IF(P115>I75,\"Beschichtung notwendig!\",\"keine Beschichtung\")","v":"keine Beschichtung"},{"$f":"G115/I71","v":2.0656569561263995},0.10311615376911144,null,null,null,{"$f":"C111","v":1125},null,{"$f":"N111","v":{"$error":"#DIV/0!"}}]
[null,"Wert z.B. am Ende des vierten Trapezes (falls vorhanden)",{"$f":"D22+D23+D24+D25+D26","v":2826},9.8000000000000007,9.7632000000000012,{"$f":"D57*((D45/2)-C116)*((D45/2)-C116)/2","v":6057.1263926085121},{"$f":"D57*((D45/2)-C116)","v":69.622142443775999},{"$f":"C26*E26/100","v":9.3263399999999983},{"$f":"H116-2*C78","v":7.3263399999999983},{"$f":"F116/I68","v":7.5714079907606404},7.1090510073371158,0.10864449633144124,{"$f":"L116*D116/K68","v":0.70981070936541624},{"$error":"#DIV/0!"},1.0647160640481244,0.9993317310612464,{"$f":"IF(P116>I75,\"Beschichtung notwendig!\",\"keine Beschichtung\")","v":"keine Beschichtung"},{"$f":"G116/I71","v":0.87027678054720004},6.1209068527501347E-2,null,null,null,{"$f":"C112","v":1500},null,{"$f":"N111","v":{"$error":"#DIV/0!"}}]
[null,"Ein Zwischenwert (beliebig einzugeben)",2961,8.4,8.3951999999999991,{"$f":"D57*((D45/2)-C117)*((D45/2)-C117)/2","v":304.29677774995196},{"$f":"D57*((D45/2)-C117)","v":15.604962961535998},{"$f":"((H116-H118)*(C117-C118)/(C116-C118))+H118","v":4.6041796551724135},{"$f":"H117-2*I80","v":4.6041796551724135},{"$f":"F117/I68","v":0.38037097218743993},4.5844249509241193,9.8773521241470874E-3,{"$f":"L117*D117/K68","v":5.5313171895223695E-2},{"$error":"#DIV/0!"},8.2969757842835543E-2,0.40522719987436245,{"$f":"IF(P117>I75,\"Beschichtung notwendig!\",\"keine Beschichtung\")","v":"keine Beschichtung"},{"$f":"G117/I71","v":0.19506203701919997},2.1274427993404031E-2,null,null,null,{"$f":"C112","v":1500},null,{"$f":"N112","v":{"$error":"#DIV/0!"}}]
[null,"Wert z.B. am Ende des fünften Trapezes (falls vorhanden)",{"$f":"D22+D23+D24+D25+D26+D27+D28","v":3000},8,8,{"$f":"D57*((D45/2)-C118)*((D45/2)-C118)/2","v":0},{"$f":"D57*((D45/2)-C118)","v":0},{"$f":"C27*E27/100","v":3.24},{"$f":"H118-2*I80","v":3.24},{"$f":"F118/I68","v":0},3.24,0,{"$f":"L118*D118/K68","v":0},{"$error":"#DIV/0!"},0,0,{"$f":"IF(P118>I75,\"Beschichtung notwendig!\",\"keine Beschichtung\")","v":"keine Beschichtung"},{"$f":"G118/I71","v":0},0,null,null,null,{"$f":"C113","v":1875},null,{"$f":"N112","v":{"$error":"#DIV/0!"}}]
[null,null,null,null,null,null,null,null,null,null,null,null,null,null,null,null,null,null,null,null,null,{"$f":"C113","v":1875},null,{"$f":"N113","v":{"$error":"#DIV/0!"}}]
[null,null,null,null,null,null,null,null,null,null,null,null,null,null,null,null,null,null,null,null,null,{"$f":"C114","v":2250},null,{"$f":"N113","v":{"$error":"#DIV/0!"}}]
[null,"Durchbiegung am Flächenende:",null,null,null,null,null,null,null,null,null,null,null,null,null,null,null,null,null,null,null,{"$f":"C114","v":2250},null,{"$f":"N114","v":{"$error":"#DIV/0!"}}]
[null,"W® = 1/2 x M(max) x b/2 x b/2 / E-Modul(Holmgurt) / J",null,null,null,null,null,null,null,null,null,null,null,null,null,null,null,null,null,null,null,{"$f":"C115","v":2587},null,{"$f":"N114","v":{"$error":"#DIV/0!"}}]
[null,"W®=",{"$f":"1/2*F107*(D45/2*D45/2)/U68/W68","v":40.633568495724951},"mm",null,null,null,null,null,null,null,null,null,null,null,null,null,null,null,null,null,{"$f":"C115","v":2587},null,{"$f":"N115","v":{"$error":"#DIV/0!"}}]
[null,null,null,null,null,null,null,null,null,null,null,null,null,null,null,null,null,null,null,null,null,{"$f":"C116","v":2826},null,{"$f":"N115","v":{"$error":"#DIV/0!"}}]
[null,null,null,null,null,null,null,null,null,null,null,null,null,null,null,null,null,null,null,null,null,{"$f":"C116","v":2826},null,{"$f":"N116","v":{"$error":"#DIV/0!"}}]
[null,null,null,null,null,null,null,null,null,null,null,null,null,null,null,null,null,null,null,null,null,{"$f":"C117","v":2961},null,{"$f":"N116","v":{"$error":"#DIV/0!"}}]
[null,null,null,null,null,null,null,null,null,null,null,null,null,null,null,null,null,null,null,null,null,{"$f":"C117","v":2961},null,{"$f":"N117","v":{"$error":"#DIV/0!"}}]
[null,null,null,null,null,null,null,null,null,null,null,null,null,null,null,null,null,null,null,null,null,{"$f":"C118","v":3000},null,{"$f":"N117","v":{"$error":"#DIV/0!"}}]
[null,null,null,null,null,null,null,null,null,null,null,null,null,null,null,null,null,null,null,null,null,{"$f":"C118","v":3000},null,{"$f":"N118","v":{"$error":"#DIV/0!"}}]

{"sheet":"Materialdaten","index":1,"n_rows":84,"n_cols":16,"rows_kept":84,"cut":false,"hidden":false,"merged":[[59,0,59,2],[60,0,60,2],[61,0,61,2]]}
["Materialkennzahlen"]
[]
["Materialien",null,null,"Spezifikation","Querschitts-flächen  [mm²]","Biegefestigkeit      Sigma (zul) [N/mm²]","Druckfestig-keit   [N/mm²]","Zugfestigkeit [N/mm²]","Schubfestig-keit        Tau(zul) [N/mm²]","Bruch-dehnung [%]","Dichte [kg/m³]","Elastizitäts-modul [N/mm² ]","Garnfeinheit in tex","Flächengewicht des UD-Geleges","Faser des UD-Geleges"]
["Gurtmaterialien","C Rovings HTA12k",1,"CFK",0.8,1000,null,800,null,1,1800,80000,800]
[null,"C Rovings HTA 24k",2,"CFK",1.5,1000,null,800,null,1,1800,80000,1600]
[null,"C Rovings C60",3,"CFK",2.5,null,null,700,null,1,null,80000]
[null,"Aramid Rovings",4,"AFK",null,null,35,192,null,3.3,1450,48000]
[null,"GfK Rovings 1,0mm²",5,"GFK",1,null,null,750,30,2.5,2500,30000]
[null,"GfK Rovings 2,0mm²",6,"GFK",2,null,null,750,30,2.5,2500,30000]
[null,"Polystahl",7,"GFK-Ex",5.7,null,null,750,null,2.5,2100,50000]
[null,"Kiefernholz",8,"längs",null,65,40,70,5,0.7,570,10000]
[null,"UD-CST50/300",9,"CFK-UD-Gelege",0.8,null,null,800,null,1,null,135000,800,50,"AS4"]
[null,"UD-CST80/200",10,"CFK-UD-Gelege",0.8,null,null,800,null,1,null,135000,800,80,"T700"]
[null,"UD-CST100/300",11,"CFK-UD-Gelege",0.8,null,null,800,null,1,null,135000,800,100,"T700"]
[null,"UD-CST125/300",12,"CFK-UD-Gelege",0.8,null,null,800,null,1,null,135000,800,125,"T700"]
[null,"UD-CST150/300",13,"CFK-UD-Gelege",0.8,null,null,800,null,1,null,135000,800,150,"T700"]
[null,"UD-CST200/300",14,"CFK-UD-Gelege",0.8,null,null,800,null,1,null,135000,800,200,"T700"]
[null,"UD-CS250/244",15,"CFK-UD-Gelege",0.8,null,null,800,null,0.4,null,230000,800,250,"UHM K63712","Faser von Sumitomo, Dichte 2,12, Zugfestigkeit 2600MPa, Zug E-Modul 640GPa, Bruchdehnung 0,4%"]
[null,"UD-CST300/50",16,"CFK-UD-Gelege",0.8,null,null,800,null,1,null,135000,800,300,"T700"]
["Stegmaterialien","AFK (Aramid-)gewebe",1,null,null,null,null,null,null,2.5,null,24000]
[null,"GFK Gewebe",2,null,null,null,90,90,80,3.5,null,15000]
[null,"CFK Gewebe",3,null,null,null,200,200,90,1.3,null,40000]
["Kernmaterial","Abachi längs",1,"längs",null,47,30,null,null,null,400,6000]
[null,"Balsaholz längs*",2,"längs",null,21,6,12.3,1.2,0.7,150,3290]
[null,"Balsaholz quer",3,"quer",null,null,12,0.7,2.1,null,150]
[null,"Kiefernholz längs",4,"längs",null,65,7.7,70,5,0.7,570,10000]
[null,"Kiefernholz quer",5,"quer",null,null,40,3,10,null,570,500]
[null,"Buchenholz längs",6,"längs",null,105,53,135,null,null,780,16000]
[null,"Buchenholz quer",7,"quer",null,null,53,7,null,null,780,1500]
[null,"Pappelholz längs",8,"längs",null,55,12,75,null,null,450,9000]
[null,"Pappelholz quer",9,"quer",null,null,37,10,null,null,450,350]
[null,"Birkensperrholz",10,null,null,80,52,132,20,1,650,8000]
[null,"Buchensperrholz",11,null,null,80,56,117,20,null,725,10000]
[null,"Rohacell 31",12,null,null,0.8,0.4,1,0.4,3.5,30,36]
[null,"Rohacell 51",13,null,null,1.6,0.9,1.9,0.8,4,50,70]
[null,"Rohacell 71",14,null,null,2.5,1.5,2.8,1.3,4.5,70,92]
[null,"Styropor PS20",15,"PS20",null,null,0.3,null,null,null,20]
[null,"Styropor PS30",16,"PS30",null,null,0.5,null,null,null,30]
[null,"Roofmate",17,null,null,null,0.3,null,null,null,32]
[null,"PVC Hartschaum 30",18,30,null,0.45,0.25,0.45,1.2,null,30]
[null,"PVC Hartschaum 40",19,40,null,0.6,0.35,0.7,2.1,null,40]
[null,"PVC Hartschaum 60",20,60,null,1.2,0.8,1.6,2.8,null,60]
[null,"PVC Hartschaum 80",21,80,null,1.8,1.2,2,3.8,null,80]
[null,"Titan",null,99.5,null,null,null,200,250,30,null,110000]
[null,"Aluminium",null,"Al-Mg 2,5",null,null,null,170,140,3,2700,71000]
[null,"Stahl",null,null,null,null,null,1200,null,null,7850,210000]
[null,"Stahldraht",null,null,null,500,350,null,null,null,7850,210000]
[null,"*für eine Rohdichte von 150kg/m3"]
[null,"längs bedeutet, dass der Faserverlauf des Holzes in Spannweitenrichtung verläuft"]
[null,"quer bedeutet, dass der Faserverlauf des Holzes von Holmgurt zu Holmgurt verläuft"]
[]
["Festigkeit von Klebe-Verbindungen","Material",null,"Schubfestigkeit Tau N/mm2"]
[null,"Holz/Holz",null,3.5]
[null,"GFK/Holz",null,3.5]
[null,"GFK/GFK",null,5]
[]
[]
[]
[null,null,null,null,null,"Faser","Faserdurchmesser in mm","Faserquerschnitt in mm^2","Fläche 24k","60% Faservolumen","Für die Anzahlberechnung zu verwenden"]
["12k = 12000 filaments = 800 tex, have a cross section of 0.7mm²",null,null,null,null,"T300",7.0000000000000001E-3,"0,38485 x 10^-4",0.92400000000000004,{"$f":"I60 * 100/60","v":1.54},1.5]
["24k = 24000 filaments = 1600 tex, have a cross section of 1.5mm²",null,null,null,null,"T800",5.0000000000000001E-3,"0,19635 x 10^-4",0.47099999999999997,{"$f":"I61*100/60","v":0.78499999999999992},0.8]
["36k = 36000 filaments = 2400 tex, have a cross section of 2.1mm²",null,null,null,null,"MR60H24P",5.0000000000000001E-3,"0,19635 x 10^-4",0.47099999999999997,0.78499999999999992,0.8]
[]
[]
[]
[]
[]
[]
[]
[]
[]
[]
[]
[]
[]
[]
[]
[]
[]
[]
[]
[]
[]
[null,"Quelle: Toray"]

{"sheet":"Flächensteckung","index":5,"n_rows":68,"n_cols":18,"rows_kept":68,"cut":false,"hidden":false,"merged":[[2,0,2,8],[13,3,13,5],[12,3,12,11],[13,6,13,8],[13,9,13,11],[12,12,12,17],[13,12,13,13],[13,14,13,15],[13,16,13,17],[25,0,28,3]]}
["Berechnung einer Flächensteckverbindung"]
[]
["Mit den Werten der Holmberechnung ist es möglich, an den Knickstellen der Tragfläche, den nötigen Querschnitt einer Tragflächensteckung zu bestimmen. Hierzu wird das Mb(x) dieser Stelle aus der Tabelle der Ergebnisse eingesetzt. Die Ergebnisse in der unten aufgeführten Tabelle ergeben sich daher automatisch mit den Ergebnissen aus 'Berechnung der Werte'."]
["Für den rechteckigen Querschnitt wird verwendet:"]
["Breite des Stabes wird berechnet und mit b4 -",1.5,null,null,", mm  anschließend  verglichen,  Höhe  ist  h1  -",{"$f":"B5","v":1.5},"mm. Diese werden für den Platzbedarf einer Hülle um den Stab abgezogen."]
[]
["b= Mb(Verbindungspunkt) x 6 / Sigma (Material) x (Steghöhe h1 - 3mm)**2"]
[]
["Für den runden Vollquerschnitt wird verwendet:"]
[]
["D=3.Wurzel (((Mb(Verbindungspunkt))/(Sigma(Material)*0,1))"]
[]
[null,null,null,"Steckverbindung mit rechteckigem Querschnitt",null,null,null,null,null,null,null,null,"Steckverbindung mit rundem Querschnitt"]
["Erklärungen der Tabellenwerte:","Abstand von der Rumpf-mittellinie","Holmbreite an dieser Stelle","Aus CFK",null,null,"Aus GFK",null,null,"Aus Stahl",null,null,"Aus CFK",null,"Aus GFK",null,"Aus Stahl"]
[null,"L(x) in mm","b(x) in mm","Berechnete Mindeststabbreite in mm (B)","maximal mögliche Stabbreite mit gewählten Holmstegbreite in mm (B)","Stabhöhe in der Rechnung in mm (H)","Berechnete Mindeststabbreite in mm","maximal mögliche Stabbreite aufgrund der gewählten Holmstegbreite in mm","Stabhöhe in der Rechnung in mm","Berechnete Mindeststabbreite in mm","maximal mögliche Stabbreite aufgrund der gewählten Holmstegbreite in mm","Stabhöhe in der Rechnung in mm","Berechneter Mindestdurchmesser in mm","maximal möglicher Durchmesser aufgrund der gewählten Holmstegbreite in mm","Berechneter Mindestdurchmesser in mm","maximal möglicher Durchmesser aufgrund der gewählten Holmstegbreite in mm","Berechneter Mindestdurchmesser in mm","maximal möglicher Durchmesser aufgrund der gewählten Holmstegbreite in mm"]
["Maximalwerte in der Rumpfmitte (L=0)",0,{"$f":"'Berechnung der Werte'!D107","v":30},{"$f":"('Berechnung der Werte'!F107*6)/(Materialdaten!$H$5*('Berechnung der Werte'!K107-$B$5)*('Berechnung der Werte'!K107-$B$5))","v":24.809470529685647},{"$f":"'Berechnung der Werte'!D107-$B$5","v":28.5},{"$f":"'Berechnung der Werte'!K107-$B$5","v":23.330669858858418},{"$f":"('Berechnung der Werte'!F107*6)/(Materialdaten!$H$8*('Berechnung der Werte'!K107-$B$5)*('Berechnung der Werte'!K107-$B$5))","v":26.463435231664693},{"$f":"'Berechnung der Werte'!D107-$B$5","v":28.5},{"$f":"'Berechnung der Werte'!K107-$B$5","v":23.330669858858418},{"$f":"('Berechnung der Werte'!F107*6)/(Materialdaten!$H$46*('Berechnung der Werte'!K107-$B$5)*('Berechnung der Werte'!K107-$B$5))","v":16.539647019790433},{"$f":"'Berechnung der Werte'!D107-$B$5","v":28.5},{"$f":"'Berechnung der Werte'!K107-$B$5","v":23.330669858858418},{"$f":"(('Berechnung der Werte'!F107/(Materialdaten!$H$5*0.1)))^(1/3)","v":28.23407434747741},{"$f":"'Berechnung der Werte'!D107-$B$5","v":28.5},{"$f":"(('Berechnung der Werte'!F107/(Materialdaten!$H$8*0.1)))^(1/3)","v":28.848049983163719},{"$f":"'Berechnung der Werte'!D107-$B$5","v":28.5},{"$f":"(('Berechnung der Werte'!F107/(Materialdaten!$H$46*0.1)))^(1/3)","v":24.664735789868519},{"$f":"'Berechnung der Werte'!D107-$B$5","v":28.5}]
["Wert an der Tragflächen Wurzelrippe",{"$f":"'Berechnung der Werte'!C108","v":0},{"$f":"'Berechnung der Werte'!D108","v":30},{"$f":"('Berechnung der Werte'!F108*6)/(Materialdaten!$H$5*('Berechnung der Werte'!K108-$B$5)*('Berechnung der Werte'!K108-$B$5))","v":24.809470529685647},{"$f":"'Berechnung der Werte'!D108-$B$5","v":28.5},{"$f":"'Berechnung der Werte'!K108-$B$5","v":23.330669858858418},{"$f":"('Berechnung der Werte'!F108*6)/(Materialdaten!$H$8*('Berechnung der Werte'!K108-$B$5)*('Berechnung der Werte'!K108-$B$5))","v":26.463435231664693},{"$f":"'Berechnung der Werte'!D108-$B$5","v":28.5},{"$f":"'Berechnung der Werte'!K108-$B$5","v":23.330669858858418},{"$f":"('Berechnung der Werte'!F108*6)/(Materialdaten!$H$46*('Berechnung der Werte'!K108-$B$5)*('Berechnung der Werte'!K108-$B$5))","v":16.539647019790433},{"$f":"'Berechnung der Werte'!D108-$B$5","v":28.5},{"$f":"'Berechnung der Werte'!K108-$B$5","v":23.330669858858418},{"$f":"(('Berechnung der Werte'!F108/(Materialdaten!$H$5*0.1)))^(1/3)","v":28.23407434747741},{"$f":"'Berechnung der Werte'!D108-$B$5","v":28.5},{"$f":"(('Berechnung der Werte'!F108/(Materialdaten!$H$8*0.1)))^(1/3)","v":28.848049983163719},{"$f":"'Berechnung der Werte'!D108-$B$5","v":28.5},{"$f":"(('Berechnung der Werte'!F108/(Materialdaten!$H$46*0.1)))^(1/3)","v":24.664735789868519},{"$f":"'Berechnung der Werte'!D108-$B$5","v":28.5}]
["Ein Zwischenwert (beliebig einzugeben)",{"$f":"'Berechnung der Werte'!C109","v":375},{"$f":"'Berechnung der Werte'!D109","v":29},{"$f":"('Berechnung der Werte'!F109*6)/(Materialdaten!$H$5*('Berechnung der Werte'!K109-$B$5)*('Berechnung der Werte'!K109-$B$5))","v":19.840066976495088},{"$f":"'Berechnung der Werte'!D109-$B$5","v":27.5},{"$f":"'Berechnung der Werte'!K109-$B$5","v":22.828240655308907},{"$f":"('Berechnung der Werte'!F109*6)/(Materialdaten!$H$8*('Berechnung der Werte'!K109-$B$5)*('Berechnung der Werte'!K109-$B$5))","v":21.162738108261426},{"$f":"'Berechnung der Werte'!D109-$B$5","v":27.5},{"$f":"'Berechnung der Werte'!K109-$B$5","v":22.828240655308907},{"$f":"('Berechnung der Werte'!F109*6)/(Materialdaten!$H$46*('Berechnung der Werte'!K109-$B$5)*('Berechnung der Werte'!K109-$B$5))","v":13.226711317663391},{"$f":"'Berechnung der Werte'!D109-$B$5","v":27.5},{"$f":"'Berechnung der Werte'!K109-$B$5","v":22.828240655308907},{"$f":"(('Berechnung der Werte'!F109/(Materialdaten!$H$5*0.1)))^(1/3)","v":25.829277369234287},{"$f":"'Berechnung der Werte'!D109-$B$5","v":27.5},{"$f":"(('Berechnung der Werte'!F109/(Materialdaten!$H$8*0.1)))^(1/3)","v":26.390958506604772},{"$f":"'Berechnung der Werte'!D109-$B$5","v":27.5},{"$f":"(('Berechnung der Werte'!F109/(Materialdaten!$H$46*0.1)))^(1/3)","v":22.563952128018467},{"$f":"'Berechnung der Werte'!D109-$B$5","v":27.5}]
["Werte z.B. am Ende des ersten Tragflächentrapezes",{"$f":"'Berechnung der Werte'!C110","v":750},{"$f":"'Berechnung der Werte'!D110","v":28},{"$f":"('Berechnung der Werte'!F110*6)/(Materialdaten!$H$5*('Berechnung der Werte'!K110-$B$5)*('Berechnung der Werte'!K110-$B$5))","v":15.329738416233541},{"$f":"'Berechnung der Werte'!D110-$B$5","v":26.5},{"$f":"'Berechnung der Werte'!K110-$B$5","v":22.260240259876323},{"$f":"('Berechnung der Werte'!F110*6)/(Materialdaten!$H$8*('Berechnung der Werte'!K110-$B$5)*('Berechnung der Werte'!K110-$B$5))","v":16.351720977315775},{"$f":"'Berechnung der Werte'!D110-$B$5","v":26.5},{"$f":"'Berechnung der Werte'!K110-$B$5","v":22.260240259876323},{"$f":"('Berechnung der Werte'!F110*6)/(Materialdaten!$H$46*('Berechnung der Werte'!K110-$B$5)*('Berechnung der Werte'!K110-$B$5))","v":10.219825610822362},{"$f":"'Berechnung der Werte'!D110-$B$5","v":26.5},{"$f":"'Berechnung der Werte'!K110-$B$5","v":22.260240259876323},{"$f":"(('Berechnung der Werte'!F110/(Materialdaten!$H$5*0.1)))^(1/3)","v":23.306714858813109},{"$f":"'Berechnung der Werte'!D110-$B$5","v":26.5},{"$f":"(('Berechnung der Werte'!F110/(Materialdaten!$H$8*0.1)))^(1/3)","v":23.813540579220611},{"$f":"'Berechnung der Werte'!D110-$B$5","v":26.5},{"$f":"(('Berechnung der Werte'!F110/(Materialdaten!$H$46*0.1)))^(1/3)","v":20.360290797838349},{"$f":"'Berechnung der Werte'!D110-$B$5","v":26.5}]
["Ein Zwischenwert (beliebig einzugeben)",{"$f":"'Berechnung der Werte'!C111","v":1125},{"$f":"'Berechnung der Werte'!D111","v":27},{"$f":"('Berechnung der Werte'!F111*6)/(Materialdaten!$H$5*('Berechnung der Werte'!K111-$B$5)*('Berechnung der Werte'!K111-$B$5))","v":12.444203584956282},{"$f":"'Berechnung der Werte'!D111-$B$5","v":25.5},{"$f":"'Berechnung der Werte'!K111-$B$5","v":20.588865654322863},{"$f":"('Berechnung der Werte'!F111*6)/(Materialdaten!$H$8*('Berechnung der Werte'!K111-$B$5)*('Berechnung der Werte'!K111-$B$5))","v":13.2738171572867},{"$f":"'Berechnung der Werte'!D111-$B$5","v":25.5},{"$f":"'Berechnung der Werte'!K111-$B$5","v":20.588865654322863},{"$f":"('Berechnung der Werte'!F111*6)/(Materialdaten!$H$46*('Berechnung der Werte'!K111-$B$5)*('Berechnung der Werte'!K111-$B$5))","v":8.2961357233041877},{"$f":"'Berechnung der Werte'!D111-$B$5","v":25.5},{"$f":"'Berechnung der Werte'!K111-$B$5","v":20.588865654322863},{"$f":"(('Berechnung der Werte'!F111/(Materialdaten!$H$5*0.1)))^(1/3)","v":20.63923355351119},{"$f":"'Berechnung der Werte'!D111-$B$5","v":25.5},{"$f":"(('Berechnung der Werte'!F111/(Materialdaten!$H$8*0.1)))^(1/3)","v":21.088052465905523},{"$f":"'Berechnung der Werte'!D111-$B$5","v":25.5},{"$f":"(('Berechnung der Werte'!F111/(Materialdaten!$H$46*0.1)))^(1/3)","v":18.030031239477328},{"$f":"'Berechnung der Werte'!D111-$B$5","v":25.5}]
["Wert z.B. am Ende des zweiten Trapezes",{"$f":"'Berechnung der Werte'!C112","v":1500},{"$f":"'Berechnung der Werte'!D112","v":23.2},{"$f":"('Berechnung der Werte'!F112*6)/(Materialdaten!$H$5*('Berechnung der Werte'!K112-$B$5)*('Berechnung der Werte'!K112-$B$5))","v":9.7560072876170576},{"$f":"'Berechnung der Werte'!D112-$B$5","v":21.7},{"$f":"'Berechnung der Werte'!K112-$B$5","v":18.602439573142725},{"$f":"('Berechnung der Werte'!F112*6)/(Materialdaten!$H$8*('Berechnung der Werte'!K112-$B$5)*('Berechnung der Werte'!K112-$B$5))","v":10.406407773458195},{"$f":"'Berechnung der Werte'!D112-$B$5","v":21.7},{"$f":"'Berechnung der Werte'!K112-$B$5","v":18.602439573142725},{"$f":"('Berechnung der Werte'!F112*6)/(Materialdaten!$H$46*('Berechnung der Werte'!K112-$B$5)*('Berechnung der Werte'!K112-$B$5))","v":6.5040048584113705},{"$f":"'Berechnung der Werte'!D112-$B$5","v":21.7},{"$f":"'Berechnung der Werte'!K112-$B$5","v":18.602439573142725},{"$f":"(('Berechnung der Werte'!F112/(Materialdaten!$H$5*0.1)))^(1/3)","v":17.786352297341814},{"$f":"'Berechnung der Werte'!D112-$B$5","v":21.7},{"$f":"(('Berechnung der Werte'!F112/(Materialdaten!$H$8*0.1)))^(1/3)","v":18.173132711103705},{"$f":"'Berechnung der Werte'!D112-$B$5","v":21.7},{"$f":"(('Berechnung der Werte'!F112/(Materialdaten!$H$46*0.1)))^(1/3)","v":15.537809905875408},{"$f":"'Berechnung der Werte'!D112-$B$5","v":21.7}]
["Ein Zwischenwert (beliebig einzugeben)",{"$f":"'Berechnung der Werte'!C113","v":1875},{"$f":"'Berechnung der Werte'!D113","v":19.399999999999999},{"$f":"('Berechnung der Werte'!F113*6)/(Materialdaten!$H$5*('Berechnung der Werte'!K113-$B$5)*('Berechnung der Werte'!K113-$B$5))","v":7.8079590336884346},{"$f":"'Berechnung der Werte'!D113-$B$5","v":17.899999999999999},{"$f":"'Berechnung der Werte'!K113-$B$5","v":15.595469758582315},{"$f":"('Berechnung der Werte'!F113*6)/(Materialdaten!$H$8*('Berechnung der Werte'!K113-$B$5)*('Berechnung der Werte'!K113-$B$5))","v":8.3284896359343321},{"$f":"'Berechnung der Werte'!D113-$B$5","v":17.899999999999999},{"$f":"'Berechnung der Werte'!K113-$B$5","v":15.595469758582315},{"$f":"('Berechnung der Werte'!F113*6)/(Materialdaten!$H$46*('Berechnung der Werte'!K113-$B$5)*('Berechnung der Werte'!K113-$B$5))","v":5.2053060224589558},{"$f":"'Berechnung der Werte'!D113-$B$5","v":17.899999999999999},{"$f":"'Berechnung der Werte'!K113-$B$5","v":15.595469758582315},{"$f":"(('Berechnung der Werte'!F113/(Materialdaten!$H$5*0.1)))^(1/3)","v":14.682310327258127},{"$f":"'Berechnung der Werte'!D113-$B$5","v":17.899999999999999},{"$f":"(('Berechnung der Werte'!F113/(Materialdaten!$H$8*0.1)))^(1/3)","v":15.001590524142902},{"$f":"'Berechnung der Werte'!D113-$B$5","v":17.899999999999999},{"$f":"(('Berechnung der Werte'!F113/(Materialdaten!$H$46*0.1)))^(1/3)","v":12.82617947908871},{"$f":"'Berechnung der Werte'!D113-$B$5","v":17.899999999999999}]
["Wert z.B. am Ende des dritten Trapezes",{"$f":"'Berechnung der Werte'!C114","v":2250},{"$f":"'Berechnung der Werte'!D114","v":15.6},{"$f":"('Berechnung der Werte'!F114*6)/(Materialdaten!$H$5*('Berechnung der Werte'!K114-$B$5)*('Berechnung der Werte'!K114-$B$5))","v":5.2130916902263023},{"$f":"'Berechnung der Werte'!D114-$B$5","v":14.1},{"$f":"'Berechnung der Werte'!K114-$B$5","v":12.724135434864793},{"$f":"('Berechnung der Werte'!F114*6)/(Materialdaten!$H$8*('Berechnung der Werte'!K114-$B$5)*('Berechnung der Werte'!K114-$B$5))","v":5.5606311362413878},{"$f":"'Berechnung der Werte'!D114-$B$5","v":14.1},{"$f":"'Berechnung der Werte'!K114-$B$5","v":12.724135434864793},{"$f":"('Berechnung der Werte'!F114*6)/(Materialdaten!$H$46*('Berechnung der Werte'!K114-$B$5)*('Berechnung der Werte'!K114-$B$5))","v":3.4753944601508682},{"$f":"'Berechnung der Werte'!D114-$B$5","v":14.1},{"$f":"'Berechnung der Werte'!K114-$B$5","v":12.724135434864793},{"$f":"(('Berechnung der Werte'!F114/(Materialdaten!$H$5*0.1)))^(1/3)","v":11.204699830133496},{"$f":"'Berechnung der Werte'!D114-$B$5","v":14.1},{"$f":"(('Berechnung der Werte'!F114/(Materialdaten!$H$8*0.1)))^(1/3)","v":11.448356222626318},{"$f":"'Berechnung der Werte'!D114-$B$5","v":14.1},{"$f":"(('Berechnung der Werte'!F114/(Materialdaten!$H$46*0.1)))^(1/3)","v":9.7882068848387487},{"$f":"'Berechnung der Werte'!D114-$B$5","v":14.1}]
[]
[]
["Ist die berechnete Stabbreite bei rechteckigem Querschnitt (D16-D23, G16-G23, J16-J23) größer als die Werte der maximal möglichen Stabbreite (E16-E23, H16-H23, K16-K23), so ist der Holmsteg an der Stelle der Steckverbindung zu verbreitern. Das gleiche gilt für die Rechnungen mit Kreisquerschnitt."]
[]
[]
[]
[]
[]
[]
[]
[]
[]
[]
[]
[null,"Stützstoffeinlage (nicht lasttragend)"]
[]
[]
[]
[]
[]
[]
[]
[]
[]
[]
[]
[]
[null,null,null,null,"Abstand von der Rumpfmittellinie (L(x) in mm) : ",750,"Wählen aus die liste!"]
[null,null,null,null,"Maximale Dicke des Verbinders (H) : ",{"$f":"VLOOKUP(F51,B16:F23,5)","v":22.260240259876323},"mm"]
[null,null,null,null,"Gewählte Dicke des Verbinders (H) :  ",22.3,"mm"]
[null,null,null,null,"Mbmax = ",{"$f":"VLOOKUP(F51,'Berechnung der Werte'!C107:F118,4)","v":1012822.1152919999},"N/mm²"]
[null,null,null,null,"Sigma = ",{"$f":"'Berechnung der Werte'!I68","v":800},"N/mm²"]
[null,null,null,null,"Maximale Breite des Verbinders (B) = ",{"$f":"VLOOKUP(F51,B16:C23,2)-B5","v":26.5},"mm"]
[null,null,null,null,"Breite des Verbinders (B) = ",26.5]
[]
[]
[null,null,null,null,"Maximale Höhe (h) des Stützstoffs im Verbinder =",{"$f":"POWER(POWER(F53,3)-(F54*6*F53/F55/F57),1/3)","v":16.747504507320979},"mm","Bei negativen Werten an dieser Stelle müssen die Abmessungen des Verbinders vergrößert werden um mit Stützstoff zu arbeiten. "]
[null,null,null,null," Benötigte Dicke c =",{"$f":"(F53-F60)/2","v":2.7762477463395108},"mm"]
[]
[]
[]
[null,null,null,null,"Länge des Verbinders ist mit",6,"mal der Profilhöhe gerechnet (eine Hälfte der Verbinderlänge):"]
[null,null,null,null,null,"5 ist empfohlen"]
[]
[null,null,null,null,"Länge Verbinderhälfte = ",{"$f":"F65*(VLOOKUP(F51,'Berechnung der Werte'!A22:E27,3)*VLOOKUP(F51,'Berechnung der Werte'!A22:E27,5)/100)","v":177.23231999999999},"mm"]

{"sheet":"Roving-Gelege Umrechnung","index":6,"n_rows":21,"n_cols":5,"rows_kept":21,"cut":false,"hidden":false,"merged":[]}
[null,"Erstellt von Jaromir Ufer"]
[null,"Umrechnung bei gleichem Fasertyp (Roving / Gelege):"]
[]
[null,"Garnfeinheit Roving in [tex]:",1600,null,"1 tex: 1 Gramm pro 1000 Meter Garn oder Roving"]
[null,"Anzahl Rovings:",1]
[null,"Flächengewicht Gelege in [g/m²]:",200]
[]
[null,"Gelegebreite, die der Anzahl der Rovings entspricht in [mm]:",{"$f":"C5*C4/C6","v":8},null,"Rovinganzahl = Gelegebreite x Flächengewicht / tex-Zahl"]
[]
[null,"Umrechnung bei unterschiedlichem Fasertyp (Roving / Gelege):"]
[]
[null,"Zugfestigkeit Roving [MPa]:",3950]
[null,"Anzahl Rovings:",1]
[null,"Garnfeinheit (tex) Roving in [g/km]:",1600]
[null,"Dichte Rovings in [g/cm³]:",1.77]
[]
[null,"Zugfestigkeit Gelege [MPa]:",2600]
[null,"Flächengewicht Gelege in [g/m²]:",250]
[null,"Dichte Rovings in [g/cm³]:",2.12]
[]
[null,"Gelegebreite, die der Anzahl der Rovings entspricht in [mm]:",{"$f":"(C12*C13*C14/C15)/(C17*C18/C19)","v":11.645719252498914}]